Target
Cyclin-dependent kinase 2
Ligand
BDBM91745
Substrate
Meas. Tech.
OctetRed
pH
7.5±n/a
Temperature
298.15±n/a K
Kd
>100000±n/a nM
Citation
 CSARdock, CD CDK2 in CSAR_FULL_RELEASE_3JULY2012 CSAR 1:0 (2012)  
Target
Name:
Cyclin-dependent kinase 2
Synonyms:
CDK2 CDK2_HUMAN Cell division protein kinase 2 Protein cereblon/Cyclin-dependent kinase 2 | p33 protein kinase
Type:
Enzyme Subunit
Mol. Mass.:
33938.17
Organism:
Homo sapiens (Human)
Description:
P24941
Residue:
298
  
Inhibitor
Name:
BDBM91745
Synonyms:
CS148
Type:
Emp. Form.:
C19H14N4O5
Mol. Mass.:
378.3383
SMILES:
[O-][N+](=O)c1cccc(c1)-c1nc(CCCN2C(=O)c3ccccc3C2=O)[o+][n-]1
: