Target
cGMP-inhibited 3',5'-cyclic phosphodiesterase 3A
Ligand
BDBM15296
Substrate
Meas. Tech.
Enzymatic Assay
pH
7.5±0
Temperature
297.15±0 K
IC50
3e+2±n/a nM
Citation
 Wang, HKunz, SChen, GSeebeck, TWan, YRobinson, HMartinelli, SKe, H Biological and structural characterization of Trypanosoma cruzi phosphodiesterase C and Implications for design of parasite selective inhibitors. J Biol Chem 287:11788-97 (2012)  
Target
Name:
cGMP-inhibited 3',5'-cyclic phosphodiesterase 3A
Synonyms:
3',5'-cyclic phosphodiesterase Cyclic GMP-inhibited phosphodiesterase A PDE3A_HUMAN Phosphodiesterase 3 (PDE3) Phosphodiesterase 3A Phosphodiesterase 3A (PDE3A1) cGMP-inhibited 3',5'-cyclic phosphodiesterase A | cGMP-inhibited 3,5-cyclic phosphodiesterase A
Type:
Enzyme
Mol. Mass.:
124966.46
Organism:
Homo sapiens (Human)
Description:
Q14432
Residue:
1141
  
Inhibitor
Name:
BDBM15296
Synonyms:
6-methyl-2-oxo-5-(pyridin-4-yl)-1,2-dihydropyridine-3-carbonitrile CHEMBL189 Primacor US9249139, Milrinone
Type:
Small organic molecule
Emp. Form.:
C12H9N3O
Mol. Mass.:
211.2194
SMILES:
Cc1[nH]c(=O)c(cc1-c1ccncc1)C#N
: