Target
A disintegrin and metalloproteinase with thrombospondin motifs 5
Ligand
BDBM92448
Substrate
Meas. Tech.
Enzyme Assay
pH
6.8±0
Temperature
310.15±0 K
Ki
5800±0.0 nM
Citation
 Devel, LBeau, FAmoura, MVera, LCassar-Lajeunesse, EGarcia, SCzarny, BStura, EADive, V Simple Pseudo-dipeptides with a P2' Glutamate: A NOVEL INHIBITOR FAMILY OF MATRIX METALLOPROTEASES AND OTHER METZINCINS. J Biol Chem 287:26647-56 (2012)  
Target
Name:
A disintegrin and metalloproteinase with thrombospondin motifs 5
Synonyms:
A disintegrin and metalloproteinase with thrombospondin motifs 5 (ADAMTS-5) ADAMTS5 ATS5_HUMAN Metalloproteinase with thrombospondin motifs 5 (ADAMTS-5)
Type:
Enzyme
Mol. Mass.:
101769.09
Organism:
Homo sapiens (Human)
Description:
Q9UNA0
Residue:
930
  
Inhibitor
Name:
BDBM92448
Synonyms:
Inhibitor, 18
Type:
Small organic molecule
Emp. Form.:
C26H26N2O4
Mol. Mass.:
430.4956
SMILES:
NC(=O)[C@H](CCC(O)=O)NC(=O)CCc1ccc(cc1)-c1ccc(cc1)-c1ccccc1
: