Target
Phosphoethanolamine N-methyltransferase 2
Ligand
BDBM50017674
Substrate
Meas. Tech.
Radiochemical Assay
pH
8±0
Temperature
298.15±0 K
IC50
13000000±1600000 nM
Citation
 Lee, SGHaakenson, WMcCarter, JPWilliams, DJHresko, MCJez, JM Thermodynamic evaluation of ligand binding in the plant-like phosphoethanolamine methyltransferases of the parasitic nematode Haemonchus contortus. J Biol Chem 286:38060-8 (2011)  
Target
Name:
Phosphoethanolamine N-methyltransferase 2
Synonyms:
Phosphoehtnaolamine Methyltransferases 2 (PMT2)
Type:
Enzyme
Mol. Mass.:
49764.45
Organism:
Caenorhabditis elegans
Description:
Q22993
Residue:
437
  
Inhibitor
Name:
BDBM50017674
Synonyms:
(2-Benzhydryloxy-ethyl)-dimethyl-amine 2-(diphenylmethoxy)-N,N-dimethylethanamine Beldin Benadryl CHEMBL657 DIPHENHYDRAMINE Diphen N-[2-(BENZHYDRYLOXY)ETHYL]-N,N-DIMETHYLAMINE US9138431, DIPHENHYDRAMINE (Benadryl) | US9333199, DIPHENHYDRAMINE (Benadryl)
Type:
Small organic molecule
Emp. Form.:
C17H21NO
Mol. Mass.:
255.3547
SMILES:
CN(C)CCOC(c1ccccc1)c1ccccc1
: