Target
Aromatase
Ligand
BDBM19461
Substrate
Meas. Tech.
Aromatase Assay
Ki
0.00109662±0.0 nM
IC50
1.0e+3±n/a nM
Citation
 Luqman, SMeena, ASingh, PKondratyuk, TPMarler, LEPezzuto, JMNegi, AS Neoflavonoids and Tetrahydroquinolones as Possible Cancer Chemopreventive Agents. Chem Biol Drug Des 80:616-624 (2012)  
Target
Name:
Aromatase
Synonyms:
ARO1 CP19A_HUMAN CYP19 CYPXIX Cytochrome P450 19A1 Cytochrome P450-C19 (CYP19) FL cytokine receptor precursor | P-450AROM
Type:
Enzyme
Mol. Mass.:
57888.92
Organism:
Homo sapiens (Human)
Description:
P11511
Residue:
503
  
Inhibitor
Name:
BDBM19461
Synonyms:
α-CA inhibitor, 5 CHEMBL32571 Naringenin (NAR) salipurpol
Type:
Estrgen Antagonist
Emp. Form.:
C15H12O5
Mol. Mass.:
272.2528
SMILES:
Oc1ccc(cc1)C1CC(=O)c2c(O)cc(O)cc2O1
: