Target
Chymotrypsinogen A
Ligand
BDBM93022
Substrate
Meas. Tech.
Kinetic Assay
Ki
600000±80000 nM
Citation
 ABRASH, HINIEMANN, C INTERACTION OF AROMATIC COMPOUNDS WITH ALPHA-CHYMOTRYPSIN. II. COMBINATION OF THE ISOMERIC INDOLE CARBOXAMIDES AND CARBOXYLATE IONS WITH THE ACTIVE SITE. Biochemistry 4:99-104 (1965)  
Target
Name:
Chymotrypsinogen A
Synonyms:
Alpha-chymotrypsin Chymotrypsin A Chymotrypsin A chain B Chymotrypsinogen A | alpha-Chymotrypsin (α-Chymotrypsin)
Type:
Serine protease
Mol. Mass.:
25670.88
Organism:
Bos taurus (bovine)
Description:
Residue:
245
  
Inhibitor
Name:
BDBM93022
Synonyms:
Indole-6-carboxamide | Indole-7-carboxamide
Type:
Small molecule
Emp. Form.:
C9H8N2O
Mol. Mass.:
160.1726
SMILES:
NC(=O)c1ccc2cc[nH]c2c1
: