Target
Chymotrypsinogen A
Ligand
BDBM93021
Substrate
Meas. Tech.
Kinetic Assay
Ki
8200000±1400000 nM
Citation
 ABRASH, HINIEMANN, C INTERACTION OF AROMATIC COMPOUNDS WITH ALPHA-CHYMOTRYPSIN. II. COMBINATION OF THE ISOMERIC INDOLE CARBOXAMIDES AND CARBOXYLATE IONS WITH THE ACTIVE SITE. Biochemistry 4:99-104 (1965)  
Target
Name:
Chymotrypsinogen A
Synonyms:
Alpha-chymotrypsin Chymotrypsin A Chymotrypsin A chain B Chymotrypsinogen A | alpha-Chymotrypsin (α-Chymotrypsin)
Type:
Serine protease
Mol. Mass.:
25670.88
Organism:
Bos taurus (bovine)
Description:
Residue:
245
  
Inhibitor
Name:
BDBM93021
Synonyms:
Indole-6-carboxylate | Indole-7-carboxylate
Type:
Small molecule
Emp. Form.:
C10H9NO2
Mol. Mass.:
175.184
SMILES:
COC(=O)c1ccc2cc[nH]c2c1
: