Target
3-dehydroquinate synthase
Ligand
BDBM93206
Substrate
Meas. Tech.
Enzyme Inhibition
Ki
1.2e+2±n/a nM
Citation
 Widlanski, TBender, SLKnowles, JR Dehydroquinate synthase: the use of substrate analogues to probe the late steps of the catalyzed reaction. Biochemistry 28:7572-82 (1989)  
Target
Name:
3-dehydroquinate synthase
Synonyms:
AROB_ECOLI | aroB
Type:
Enzyme
Mol. Mass.:
38878.02
Organism:
Escherichia coli (strain K12)
Description:
P07639
Residue:
362
  
Inhibitor
Name:
BDBM93206
Synonyms:
2,4,5-trihydroxy-6-(phosphonatomethyl)oxane-2-carboxylate, 4
Type:
Small molecule
Emp. Form.:
C7H10O9P
Mol. Mass.:
269.1243
SMILES:
OC1CC(O)(OC(CP([O-])([O-])=O)C1O)C([O-])=O
: