Target
Beta-lactamase
Ligand
BDBM41384
Substrate
IC50
15204±n/a nM
Citation
 PubChem, PC Counterscreen for inhibitors of the interaction of nucleotide-binding oligomerization domain containing 2 (NOD2) and receptor-interacting serine-threonine kinase 2 (RIPK2) PubChem Bioassay (2012)[AID] 
Target
Name:
Beta-lactamase
Synonyms:
Beta lactamase
Type:
Enzyme Catalytic Domain
Mol. Mass.:
31513.38
Organism:
Pseudomonas aeruginosa
Description:
gi_114881106
Residue:
286
  
Inhibitor
Name:
BDBM41384
Synonyms:
MLS000042033 N-[(1S,2R)-1-[5-[(2,5-dimethylphenyl)methylsulfonyl]-1,3,4-oxadiazol-2-yl]-2-methylbutyl]carbamic acid tert-butyl ester cid_664366 tert-butyl N-[(1S,2R)-1-[5-[(2,5-dimethylphenyl)methylsulfonyl]-1,3,4-oxadiazol-2-yl]-2-methylbutyl]carbamate
Type:
Small organic molecule
Emp. Form.:
C21H31N3O5S
Mol. Mass.:
437.553
SMILES:
CC[C@@H](C)[C@H](NC(=O)OC(C)(C)C)c1nnc(o1)S(=O)(=O)Cc1cc(C)ccc1C
: