Target
Beta-lactamase
Ligand
BDBM93526
Substrate
IC50
11645±n/a nM
Citation
 PubChem, PC Counterscreen for inhibitors of the interaction of nucleotide-binding oligomerization domain containing 2 (NOD2) and receptor-interacting serine-threonine kinase 2 (RIPK2) PubChem Bioassay (2012)[AID] 
Target
Name:
Beta-lactamase
Synonyms:
Beta lactamase
Type:
Enzyme Catalytic Domain
Mol. Mass.:
31513.38
Organism:
Pseudomonas aeruginosa
Description:
gi_114881106
Residue:
286
  
Inhibitor
Name:
BDBM93526
Synonyms:
4-(keto-methyl-oxido-sulfuraniumyl)-3-nitro-benzoic acid [2-[4-(2-cyclohexylethyl)piperazino]-2-keto-ethyl] ester;2,2,2-trifluoroacetic acid SMR001566907 | cid_56643191
Type:
Small organic molecule
Emp. Form.:
C22H31N3O7S
Mol. Mass.:
481.562
SMILES:
CS(=O)(=O)c1ccc(cc1[N+]([O-])=O)C(=O)OCC(=O)N1CCN(CCC2CCCCC2)CC1
: