Target
Receptor-interacting serine/threonine-protein kinase 2
Ligand
BDBM48011
Substrate
IC50
1738±n/a nM
Citation
 PubChem, PC Fluorescence-based cell-based high throughput dose response assay for inhibitors of the interaction of nucleotide-binding oligomerization domain containing 2 (NOD2) and the receptor-interacting serine-threonine kinase 2 (RIPK2) PubChem Bioassay (2012)[AID] 
Target
Name:
Receptor-interacting serine/threonine-protein kinase 2
Synonyms:
CARDIAK RIP2 RIPK2_HUMAN Tyrosine-protein kinase RIPK2 | receptor-interacting serine/threonine-protein kinase 2
Type:
Protein
Mol. Mass.:
61201.30
Organism:
Homo sapiens (Human)
Description:
Residue:
540
  
Inhibitor
Name:
BDBM48011
Synonyms:
1-benzyl-5-[(E)-2-nitroethenyl]indole 1-benzyl-5-[(E)-2-nitrovinyl]indole MLS001198402 cid_674819
Type:
Small organic molecule
Emp. Form.:
C17H14N2O2
Mol. Mass.:
278.3053
SMILES:
[O-][N+](=O)\C=C\c1ccc2n(Cc3ccccc3)ccc2c1
: