Target
Receptor-interacting serine/threonine-protein kinase 2
Ligand
BDBM60990
Substrate
IC50
1402±n/a nM
Citation
 PubChem, PC Fluorescence-based cell-based high throughput dose response assay for inhibitors of the interaction of nucleotide-binding oligomerization domain containing 2 (NOD2) and the receptor-interacting serine-threonine kinase 2 (RIPK2) PubChem Bioassay (2012)[AID] 
Target
Name:
Receptor-interacting serine/threonine-protein kinase 2
Synonyms:
CARDIAK RIP2 RIPK2_HUMAN Tyrosine-protein kinase RIPK2 | receptor-interacting serine/threonine-protein kinase 2
Type:
Protein
Mol. Mass.:
61201.30
Organism:
Homo sapiens (Human)
Description:
Residue:
540
  
Inhibitor
Name:
BDBM60990
Synonyms:
MLS001336050 Thime-rosal cid_16684434 sodium;(2-carboxylatophenyl)sulfanyl-ethyl-mercury sodium;[(2-carboxylatophenyl)thio]-ethyl-mercury | sodium;[(2-carboxylatophenyl)thio]-ethylmercury
Type:
Small organic molecule
Emp. Form.:
C9H9HgO2S
Mol. Mass.:
381.82
SMILES:
CC[Hg]Sc1ccccc1C([O-])=O
: