Target
Receptor-interacting serine/threonine-protein kinase 2
Ligand
BDBM42060
Substrate
IC50
1773±n/a nM
Citation
 PubChem, PC Fluorescence-based cell-based high throughput dose response assay for inhibitors of the interaction of nucleotide-binding oligomerization domain containing 2 (NOD2) and the receptor-interacting serine-threonine kinase 2 (RIPK2) PubChem Bioassay (2012)[AID] 
Target
Name:
Receptor-interacting serine/threonine-protein kinase 2
Synonyms:
CARDIAK RIP2 RIPK2_HUMAN Tyrosine-protein kinase RIPK2 | receptor-interacting serine/threonine-protein kinase 2
Type:
Protein
Mol. Mass.:
61201.30
Organism:
Homo sapiens (Human)
Description:
Residue:
540
  
Inhibitor
Name:
BDBM42060
Synonyms:
4,5-bis(chloranyl)-2-[2-(4-naphthalen-2-ylsulfonylpiperazin-1-yl)-2-oxidanylidene-ethyl]pyridazin-3-one 4,5-dichloro-2-[2-[4-(2-naphthalenylsulfonyl)-1-piperazinyl]-2-oxoethyl]-3-pyridazinone MLS000374746 cid_2585042
Type:
Small organic molecule
Emp. Form.:
C20H18Cl2N4O4S
Mol. Mass.:
481.352
SMILES:
Clc1cnn(CC(=O)N2CCN(CC2)S(=O)(=O)c2ccc3ccccc3c2)c(=O)c1Cl
: