Target
Receptor-interacting serine/threonine-protein kinase 2
Ligand
BDBM93507
Substrate
IC50
1628±n/a nM
Citation
 PubChem, PC Fluorescence-based cell-based high throughput dose response assay for inhibitors of the interaction of nucleotide-binding oligomerization domain containing 2 (NOD2) and the receptor-interacting serine-threonine kinase 2 (RIPK2) PubChem Bioassay (2012)[AID] 
Target
Name:
Receptor-interacting serine/threonine-protein kinase 2
Synonyms:
CARDIAK RIP2 RIPK2_HUMAN Tyrosine-protein kinase RIPK2 | receptor-interacting serine/threonine-protein kinase 2
Type:
Protein
Mol. Mass.:
61201.30
Organism:
Homo sapiens (Human)
Description:
Residue:
540
  
Inhibitor
Name:
BDBM93507
Synonyms:
MLS002701874 cid_341502
Type:
Small organic molecule
Emp. Form.:
C18H14O5
Mol. Mass.:
310.3008
SMILES:
[H]C12OC([H])(C(C(=O)OC)=C1C(=O)OC)c1cc3ccccc3cc21
: