Target
Protein skinhead-1
Ligand
BDBM49288
Substrate
IC50
11500±n/a nM
Citation
 PubChem, PC Dose ResponseConfirmation of SKN-1 Inhibitor hits in a fluorescence ratio assay - Set 2 PubChem Bioassay (2012)[AID] 
Target
Name:
Protein skinhead-1
Synonyms:
SKN1_CAEEL skn-1
Type:
Enzyme Catalytic Domain
Mol. Mass.:
70701.17
Organism:
Caenorhabditis elegans
Description:
P34707
Residue:
623
  
Inhibitor
Name:
BDBM49288
Synonyms:
(5-chloro-2-pyridyl)-[4-(2-thienyl)thiazol-2-yl]amine MLS000064746 N-(5-chloro-2-pyridinyl)-4-thiophen-2-yl-2-thiazolamine SMR000077573 | cid_2214576
Type:
Small organic molecule
Emp. Form.:
C12H8ClN3S2
Mol. Mass.:
293.795
SMILES:
Clc1ccc(Nc2nc(cs2)-c2cccs2)nc1
: