Target
Protein skinhead-1
Ligand
BDBM93924
Substrate
IC50
8890±n/a nM
Citation
 PubChem, PC Dose ResponseConfirmation of SKN-1 Inhibitor hits in a fluorescence ratio assay - Set 2 PubChem Bioassay (2012)[AID] 
Target
Name:
Protein skinhead-1
Synonyms:
SKN1_CAEEL skn-1
Type:
Enzyme Catalytic Domain
Mol. Mass.:
70701.17
Organism:
Caenorhabditis elegans
Description:
P34707
Residue:
623
  
Inhibitor
Name:
BDBM93924
Synonyms:
1-[4-(4-nitrobenzyl)oxybenzyl]piperidine MLS002699551 cid_45280878
Type:
Small organic molecule
Emp. Form.:
C19H22N2O3
Mol. Mass.:
326.3896
SMILES:
[O-][N+](=O)c1ccc(COc2ccc(CN3CCCCC3)cc2)cc1
: