Target
Caspase-3
Ligand
BDBM33797
Substrate
IC50
>100000±0 nM
Citation
 PubChem, PC Dose-response confirmation of uHTS inhibitor hits of Sentrin-Specific Protease 8 in a Caspase-3 Fluorescence assay PubChem Bioassay (2012)[AID] 
Target
Name:
Caspase-3
Synonyms:
Apopain CASP3 CPP-32 Caspase 3 Caspase-3 subunit p17 SCA-1 Yama protein | caspase-3 preproprotein
Type:
Hydrolase; heterotetramer of two heterodimers
Mol. Mass.:
31607.55
Organism:
Homo sapiens (Human)
Description:
Residue:
277
  
Inhibitor
Name:
BDBM33797
Synonyms:
MLS000727576 N-[4-(dimethylamino)phenyl]-4-[(4-nitro-1H-pyrazol-1-yl)methyl]benzamide SMR000306273 | cid_5048498
Type:
Small organic molecule
Emp. Form.:
C19H19N5O3
Mol. Mass.:
365.3859
SMILES:
CN(C)c1ccc(NC(=O)c2ccc(Cn3cc(cn3)[N+]([O-])=O)cc2)cc1
: