Target
Protein Wnt-3a
Ligand
BDBM36933
Substrate
IC50
1070±n/a nM
Citation
 PubChem, PC Dose response validation of uHTS Gli-SUFU antagonist hits in a Wnt3a luminescent reporter assay PubChem Bioassay (2012)[AID] 
Target
Name:
Protein Wnt-3a
Synonyms:
WNT3A_MOUSE Wnt3a | protein Wnt-3a precursor
Type:
PROTEIN
Mol. Mass.:
39269.29
Organism:
Mus musculus
Description:
ChEMBL_813156
Residue:
352
  
Inhibitor
Name:
BDBM36933
Synonyms:
MLS000041708 N-[2-(3,4-dimethoxyphenyl)ethyl]-[1]benzofuro[3,2-d]pyrimidin-4-amine;hydrochloride benzofuro[3,2-d]pyrimidin-4-yl(homoveratryl)amine;hydrochloride | cid_6603430
Type:
Small organic molecule
Emp. Form.:
C20H19N3O3
Mol. Mass.:
349.3832
SMILES:
COc1ccc(CCNc2ncnc3c4ccccc4oc23)cc1OC
: