Target
Heat shock protein hsp-16.2
Ligand
BDBM89825
Substrate
IC50
>64000±n/a nM
Citation
 PubChem, PC Dose Response Confirmation of SKN-1 Inhibitor hits via a heat-shock counterscreen assay PubChem Bioassay (2012)[AID] 
Target
Name:
Heat shock protein hsp-16.2
Synonyms:
HSP12_CAEEL hsp-16 hsp16-2
Type:
Enzyme Catalytic Domain
Mol. Mass.:
16239.18
Organism:
Caenorhabditis elegans
Description:
gi_373219859
Residue:
145
  
Inhibitor
Name:
BDBM89825
Synonyms:
2-(4-Fluoro-phenyl)-chromen-4-one 2-(4-fluorophenyl)chromen-4-one MLS000526645 cid_261391
Type:
Small organic molecule
Emp. Form.:
C15H9FO2
Mol. Mass.:
240.2292
SMILES:
Fc1ccc(cc1)-c1cc(=O)c2ccccc2o1
: