Target
Heat shock protein hsp-16.2
Ligand
BDBM93813
Substrate
IC50
>64000±n/a nM
Citation
 PubChem, PC Dose Response Confirmation of SKN-1 Inhibitor hits via a heat-shock counterscreen assay PubChem Bioassay (2012)[AID] 
Target
Name:
Heat shock protein hsp-16.2
Synonyms:
HSP12_CAEEL hsp-16 hsp16-2
Type:
Enzyme Catalytic Domain
Mol. Mass.:
16239.18
Organism:
Caenorhabditis elegans
Description:
gi_373219859
Residue:
145
  
Inhibitor
Name:
BDBM93813
Synonyms:
6-bromanyl-2-pyrrolidin-1-yl-1,3-benzothiazole 6-bromo-2-pyrrolidin-1-yl-1,3-benzothiazole MLS000684725 cid_6622296
Type:
Small organic molecule
Emp. Form.:
C11H11BrN2S
Mol. Mass.:
283.187
SMILES:
Brc1ccc2nc(sc2c1)N1CCCC1
: