Target
Heat shock protein hsp-16.2
Ligand
BDBM93914
Substrate
IC50
>64000±n/a nM
Citation
 PubChem, PC Dose Response Confirmation of SKN-1 Inhibitor hits via a heat-shock counterscreen assay PubChem Bioassay (2012)[AID] 
Target
Name:
Heat shock protein hsp-16.2
Synonyms:
HSP12_CAEEL hsp-16 hsp16-2
Type:
Enzyme Catalytic Domain
Mol. Mass.:
16239.18
Organism:
Caenorhabditis elegans
Description:
gi_373219859
Residue:
145
  
Inhibitor
Name:
BDBM93914
Synonyms:
2-(P-CHLOROSTYRYL)PYRIDINE 2-[2-(4-chlorophenyl)vinyl]pyridine SMR001547053 | cid_219326
Type:
Small organic molecule
Emp. Form.:
C13H10ClN
Mol. Mass.:
215.678
SMILES:
Clc1ccc(C=Cc2ccccn2)cc1
: