Target
Heat shock protein hsp-16.2
Ligand
BDBM93758
Substrate
IC50
22560±n/a nM
Citation
 PubChem, PC Dose Response Confirmation of SKN-1 Inhibitor hits via a heat-shock counterscreen assay PubChem Bioassay (2012)[AID] 
Target
Name:
Heat shock protein hsp-16.2
Synonyms:
HSP12_CAEEL hsp-16 hsp16-2
Type:
Enzyme Catalytic Domain
Mol. Mass.:
16239.18
Organism:
Caenorhabditis elegans
Description:
gi_373219859
Residue:
145
  
Inhibitor
Name:
BDBM93758
Synonyms:
MLS000534624 N-[4-(5-chloro-2-thienyl)-1,3-thiazol-2-yl]benzamide N-[4-(5-chloro-2-thiophenyl)-2-thiazolyl]benzamide SMR000142061 | cid_801259
Type:
Small organic molecule
Emp. Form.:
C14H9ClN2OS2
Mol. Mass.:
320.817
SMILES:
Clc1ccc(s1)-c1csc(NC(=O)c2ccccc2)n1
: