Target
Heat shock protein hsp-16.2
Ligand
BDBM93781
Substrate
IC50
21420±n/a nM
Citation
 PubChem, PC Dose Response Confirmation of SKN-1 Inhibitor hits via a heat-shock counterscreen assay PubChem Bioassay (2012)[AID] 
Target
Name:
Heat shock protein hsp-16.2
Synonyms:
HSP12_CAEEL hsp-16 hsp16-2
Type:
Enzyme Catalytic Domain
Mol. Mass.:
16239.18
Organism:
Caenorhabditis elegans
Description:
gi_373219859
Residue:
145
  
Inhibitor
Name:
BDBM93781
Synonyms:
(E)-3-(2,4-difluoroanilino)-1-(2-thienyl)prop-2-en-1-one (E)-3-(2,4-difluoroanilino)-1-thiophen-2-ylprop-2-en-1-one 3-[(2,4-difluorophenyl)amino]-1-(2-thienyl)-2-propen-1-one SMR000200020 | cid_2210693
Type:
Small organic molecule
Emp. Form.:
C13H9F2NOS
Mol. Mass.:
265.278
SMILES:
Fc1ccc(N=CCC(=O)c2cccs2)c(F)c1
: