Target
Heat shock protein hsp-16.2
Ligand
BDBM93754
Substrate
IC50
>64000±n/a nM
Citation
 PubChem, PC Dose Response Confirmation of SKN-1 Inhibitor hits via a heat-shock counterscreen assay PubChem Bioassay (2012)[AID] 
Target
Name:
Heat shock protein hsp-16.2
Synonyms:
HSP12_CAEEL hsp-16 hsp16-2
Type:
Enzyme Catalytic Domain
Mol. Mass.:
16239.18
Organism:
Caenorhabditis elegans
Description:
gi_373219859
Residue:
145
  
Inhibitor
Name:
BDBM93754
Synonyms:
2-(3-chloranylthiophen-2-yl)quinoline 2-(3-chloro-2-thiophenyl)quinoline MLS000541386 cid_1487778
Type:
Small organic molecule
Emp. Form.:
C13H8ClNS
Mol. Mass.:
245.727
SMILES:
Clc1ccsc1-c1ccc2ccccc2n1
: