Target
Heat shock protein hsp-16.2
Ligand
BDBM93894
Substrate
IC50
>64000±n/a nM
Citation
 PubChem, PC Dose Response Confirmation of SKN-1 Inhibitor hits via a heat-shock counterscreen assay PubChem Bioassay (2012)[AID] 
Target
Name:
Heat shock protein hsp-16.2
Synonyms:
HSP12_CAEEL hsp-16 hsp16-2
Type:
Enzyme Catalytic Domain
Mol. Mass.:
16239.18
Organism:
Caenorhabditis elegans
Description:
gi_373219859
Residue:
145
  
Inhibitor
Name:
BDBM93894
Synonyms:
MLS001175821 N-(2-thiazolyl)-2-quinolinecarboxamide SMR000595306 | cid_2576269
Type:
Small organic molecule
Emp. Form.:
C13H9N3OS
Mol. Mass.:
255.295
SMILES:
O=C(Nc1nccs1)c1ccc2ccccc2n1
: