Target
Endothelial PAS domain-containing protein 1
Ligand
BDBM39089
Substrate
IC50
1100±n/a nM
Citation
 PubChem, PC Dose response confirmation of uHTS identification of HIF-2a Inhibitors in a luminesence assay PubChem Bioassay (2012)[AID] 
Target
Name:
Endothelial PAS domain-containing protein 1
Synonyms:
BHLHE73 EPAS1_HUMAN MOP2 endothelial PAS domain-containing protein 1
Type:
PROTEIN
Mol. Mass.:
96453.58
Organism:
Homo sapiens (Human)
Description:
ChEMBL_1506501
Residue:
870
  
Inhibitor
Name:
BDBM39089
Synonyms:
2-(5-bromanyl-2-chloranyl-phenyl)-1,3-benzoxazol-5-amine MLS000036810 [2-(5-bromo-2-chloro-phenyl)-1,3-benzoxazol-5-yl]amine | cid_659499
Type:
Small organic molecule
Emp. Form.:
C13H8BrClN2O
Mol. Mass.:
323.572
SMILES:
Nc1ccc2oc(nc2c1)-c1cc(Br)ccc1Cl
: