Target
Endothelial PAS domain-containing protein 1
Ligand
BDBM93968
Substrate
IC50
2360±n/a nM
Citation
 PubChem, PC Dose response confirmation of uHTS identification of HIF-2a Inhibitors in a luminesence assay PubChem Bioassay (2012)[AID] 
Target
Name:
Endothelial PAS domain-containing protein 1
Synonyms:
BHLHE73 EPAS1_HUMAN MOP2 endothelial PAS domain-containing protein 1
Type:
PROTEIN
Mol. Mass.:
96453.58
Organism:
Homo sapiens (Human)
Description:
ChEMBL_1506501
Residue:
870
  
Inhibitor
Name:
BDBM93968
Synonyms:
2-[[5-(3-chloro-1-benzothiophen-2-yl)-1,3,4-oxadiazol-2-yl]thio]acetic acid methyl ester MLS000575827 cid_707664 methyl 2-[[5-(3-chloro-1-benzothiophen-2-yl)-1,3,4-oxadiazol-2-yl]sulfanyl]acetate | methyl {[5-(3-chloro-1-benzothien-2-yl)-1,3,4-oxadiazol-2-yl]thio}acetate
Type:
Small organic molecule
Emp. Form.:
C13H9ClN2O3S2
Mol. Mass.:
340.805
SMILES:
COC(=O)CSc1nnc(o1)-c1sc2ccccc2c1Cl
: