Target
Endothelial PAS domain-containing protein 1
Ligand
BDBM94003
Substrate
IC50
276±n/a nM
Citation
 PubChem, PC Dose response confirmation of uHTS identification of HIF-2a Inhibitors in a luminesence assay PubChem Bioassay (2012)[AID] 
Target
Name:
Endothelial PAS domain-containing protein 1
Synonyms:
BHLHE73 EPAS1_HUMAN MOP2 endothelial PAS domain-containing protein 1
Type:
PROTEIN
Mol. Mass.:
96453.58
Organism:
Homo sapiens (Human)
Description:
ChEMBL_1506501
Residue:
870
  
Inhibitor
Name:
BDBM94003
Synonyms:
3-(2-keto-4-methyl-6,7,8,9-tetrahydrobenzofuro[3,2-g]chromen-3-yl)propionic acid 3-(4-methyl-2-oxo-6,7,8,9-tetrahydro-2H-[1]benzofuro[3,2-g]chromen-3-yl)propanoic acid 3-(4-methyl-2-oxo-6,7,8,9-tetrahydrobenzofuro[3,2-g][1]benzopyran-3-yl)propanoic acid SMR000301156 | cid_907197
Type:
Small organic molecule
Emp. Form.:
C19H18O5
Mol. Mass.:
326.3432
SMILES:
Cc1c(CCC(O)=O)c(=O)oc2cc3oc4CCCCc4c3cc12
: