Target
Corticotropin-releasing factor-binding protein
Ligand
BDBM65283
Substrate
IC50
5930±n/a nM
Citation
 PubChem, PC Dose Response confirmation of uHTS hits for small molecule antagonists of the CRF-binding protein and CRF-R2 receptor complex in 384 well format PubChem Bioassay (2012)[AID] 
Target
Name:
Corticotropin-releasing factor-binding protein
Synonyms:
CRFBP CRHBP_HUMAN | corticotropin releasing factor-binding protein
Type:
Enzyme Catalytic Domain
Mol. Mass.:
36143.95
Organism:
Homo sapiens (Human)
Description:
P24387
Residue:
322
  
Inhibitor
Name:
BDBM65283
Synonyms:
4-({[(4-biphenylylcarbonyl)amino]carbonothioyl}amino)benzoic acid 4-[(4-phenylbenzoyl)thiocarbamoylamino]benzoic acid 4-[[[[oxo-(4-phenylphenyl)methyl]amino]-sulfanylidenemethyl]amino]benzoic acid SMR000298980 | cid_1017047
Type:
Small organic molecule
Emp. Form.:
C21H16N2O3S
Mol. Mass.:
376.428
SMILES:
OC(=O)c1ccc(NC(=S)NC(=O)c2ccc(cc2)-c2ccccc2)cc1
: