Target
Corticotropin-releasing factor-binding protein
Ligand
BDBM91366
Substrate
IC50
1330±n/a nM
Citation
 PubChem, PC Dose Response confirmation of uHTS hits for small molecule antagonists of the CRF-binding protein and CRF-R2 receptor complex in 384 well format PubChem Bioassay (2012)[AID] 
Target
Name:
Corticotropin-releasing factor-binding protein
Synonyms:
CRFBP CRHBP_HUMAN | corticotropin releasing factor-binding protein
Type:
Enzyme Catalytic Domain
Mol. Mass.:
36143.95
Organism:
Homo sapiens (Human)
Description:
P24387
Residue:
322
  
Inhibitor
Name:
BDBM91366
Synonyms:
(1S,12bS)-3-[2-[[(2E)-3,7-dimethylocta-2,6-dienyl]amino]-2-keto-ethyl]-N,N-diethyl-4-keto-9-methoxy-12b-methyl-1,2,3,6,7,12-hexahydropyrido[2,1-a]-carboline-1-carboxamide (1S,12bS)-3-[2-[[(2E)-3,7-dimethylocta-2,6-dienyl]amino]-2-oxoethyl]-N,N-diethyl-9-methoxy-12b-methyl-4-oxo-1,2,3,6,7,12-hexahydroindolo[2,3-a]quinolizine-1-carboxamide SMR001530050 | cid_44601757
Type:
Small organic molecule
Emp. Form.:
C34H48N4O4
Mol. Mass.:
576.7693
SMILES:
CCN(CC)C(=O)[C@H]1CC(CC(=O)NC\C=C(/C)CCC=C(C)C)C(=O)N2CCc3c([nH]c4ccc(OC)cc34)[C@]12C
: