Target
Neuropilin-1
Ligand
BDBM37415
Substrate
IC50
30100±n/a nM
Citation
 PubChem, PC Dose Response confirmation of small molecule modulators of the interaction between CendR and NRP-1 in a panel assay PubChem Bioassay (2012)[AID] 
Target
Name:
Neuropilin-1
Synonyms:
Chain A, Crystal Structure Of The B1b2 Domains From Human Neuropilin- 1 NRP1 Neuropilin-1 | VEGF165R
Type:
PROTEIN
Mol. Mass.:
103122.09
Organism:
Homo sapiens (Human)
Description:
ChEMBL_617636
Residue:
923
  
Inhibitor
Name:
BDBM37415
Synonyms:
4-amino-3-ethyl-N-(3-pyridinylmethyl)-2-sulfanylidene-5-thiazolecarboxamide 4-amino-3-ethyl-N-(pyridin-3-ylmethyl)-2-sulfanylidene-1,3-thiazole-5-carboxamide 4-azanyl-3-ethyl-N-(pyridin-3-ylmethyl)-2-sulfanylidene-1,3-thiazole-5-carboxamide SMR000020089 | cid_3241709
Type:
Small organic molecule
Emp. Form.:
C12H14N4OS2
Mol. Mass.:
294.396
SMILES:
CCn1c(N)c(sc1=S)C(=O)NCc1cccnc1
: