Target
Neuropilin-1
Ligand
BDBM94225
Substrate
IC50
>95000±n/a nM
Citation
 PubChem, PC Dose Response confirmation of small molecule modulators of the interaction between CendR and NRP-1 in a panel assay PubChem Bioassay (2012)[AID] 
Target
Name:
Neuropilin-1
Synonyms:
Chain A, Crystal Structure Of The B1b2 Domains From Human Neuropilin- 1 NRP1 Neuropilin-1 | VEGF165R
Type:
PROTEIN
Mol. Mass.:
103122.09
Organism:
Homo sapiens (Human)
Description:
ChEMBL_617636
Residue:
923
  
Inhibitor
Name:
BDBM94225
Synonyms:
3-[(2R,3S,5R)-3-hydroxy-5-(5-methyl-2,4-dioxo-1-pyrimidinyl)-2-oxolanyl]-N-[2-(2-naphthalenyl)ethyl]propanamide 3-[(2R,3S,5R)-5-(2,4-diketo-5-methyl-pyrimidin-1-yl)-3-hydroxy-tetrahydrofuran-2-yl]-N-[2-(2-naphthyl)ethyl]propionamide MLS003271162 cid_51360183
Type:
Small organic molecule
Emp. Form.:
C24H27N3O5
Mol. Mass.:
437.4883
SMILES:
Cc1cn([C@H]2C[C@H](O)[C@@H](CCC(=O)NCCc3ccc4ccccc4c3)O2)c(=O)[nH]c1=O
: