Target
Perilipin-5
Ligand
BDBM70875
Substrate
IC50
2095±n/a nM
Citation
 PubChem, PC Luminescence-based biochemical high throughput dose response assay for inhibitors of the interaction of the lipase co-activator protein, abhydrolase domain containing 5 (ABHD5) with perilipin-5 (MLDP; PLIN5) PubChem Bioassay (2012)[AID] 
Target
Name:
Perilipin-5
Synonyms:
LSDP5 PAT-1 PLIN5_HUMAN
Type:
Enzyme Catalytic Domain
Mol. Mass.:
50774.20
Organism:
Homo sapiens (Human)
Description:
gi_116292172
Residue:
463
  
Inhibitor
Name:
BDBM70875
Synonyms:
(Z)-2-(1,3-benzothiazol-2-yl)-N-(4-chlorophenyl)-3-(3-hydroxyphenyl)-2-propenamide (Z)-2-(1,3-benzothiazol-2-yl)-N-(4-chlorophenyl)-3-(3-hydroxyphenyl)prop-2-enamide SMR000248103 | cid_8259799
Type:
Small organic molecule
Emp. Form.:
C22H15ClN2O2S
Mol. Mass.:
406.885
SMILES:
Oc1cccc(\C=C(\C(=O)Nc2ccc(Cl)cc2)c2nc3ccccc3s2)c1
: