Target
Perilipin-5
Ligand
BDBM94529
Substrate
IC50
1808±n/a nM
Citation
 PubChem, PC Luminescence-based biochemical high throughput dose response assay for inhibitors of the interaction of the lipase co-activator protein, abhydrolase domain containing 5 (ABHD5) with perilipin-5 (MLDP; PLIN5) PubChem Bioassay (2012)[AID] 
Target
Name:
Perilipin-5
Synonyms:
LSDP5 PAT-1 PLIN5_HUMAN
Type:
Enzyme Catalytic Domain
Mol. Mass.:
50774.20
Organism:
Homo sapiens (Human)
Description:
gi_116292172
Residue:
463
  
Inhibitor
Name:
BDBM94529
Synonyms:
MLS003674195 N-(2,6-dimethylphenyl)-2-[3-(2-furyl)-2-keto-quinoxalin-1-yl]-2-(1-naphthyl)acetamide N-(2,6-dimethylphenyl)-2-[3-(furan-2-yl)-2-oxoquinoxalin-1-yl]-2-naphthalen-1-ylacetamide cid_53383320
Type:
Small organic molecule
Emp. Form.:
C32H25N3O3
Mol. Mass.:
499.5592
SMILES:
Cc1cccc(C)c1NC(=O)C(c1cccc2ccccc12)n1c2ccccc2nc(-c2ccco2)c1=O
: