Target
Perilipin-5
Ligand
BDBM94629
Substrate
IC50
1142±n/a nM
Citation
 PubChem, PC Luminescence-based biochemical high throughput dose response assay for inhibitors of the interaction of the lipase co-activator protein, abhydrolase domain containing 5 (ABHD5) with perilipin-5 (MLDP; PLIN5) PubChem Bioassay (2012)[AID] 
Target
Name:
Perilipin-5
Synonyms:
LSDP5 PAT-1 PLIN5_HUMAN
Type:
Enzyme Catalytic Domain
Mol. Mass.:
50774.20
Organism:
Homo sapiens (Human)
Description:
gi_116292172
Residue:
463
  
Inhibitor
Name:
BDBM94629
Synonyms:
MLS003674203 N-cyclohexyl-2-[3-(2-furyl)-2-keto-quinoxalin-1-yl]-2-(4-methoxyphenyl)acetamide N-cyclohexyl-2-[3-(furan-2-yl)-2-oxoquinoxalin-1-yl]-2-(4-methoxyphenyl)acetamide cid_53383328
Type:
Small organic molecule
Emp. Form.:
C27H27N3O4
Mol. Mass.:
457.521
SMILES:
COc1ccc(cc1)C(C(=O)NC1CCCCC1)n1c2ccccc2nc(-c2ccco2)c1=O
: