Target
Xylosyl- and glucuronyltransferase LARGE1
Ligand
BDBM94723
Substrate
EC50
8540±n/a nM
Citation
 PubChem, PC Dose response confirmation of small molecule activators of alpha dystroglycan glycosylation PubChem Bioassay (2012)[AID] 
Target
Name:
Xylosyl- and glucuronyltransferase LARGE1
Synonyms:
KIAA0609 LARGE | LARGE1
Type:
Enzyme Catalytic Domain
Mol. Mass.:
88079.63
Organism:
Homo sapiens (Human)
Description:
gi_47678551
Residue:
756
  
Inhibitor
Name:
BDBM94723
Synonyms:
MLS000662117 N-[(1-ethyl-2-pyrrolidinyl)methyl]-N'-[4-(pentyloxy)phenyl]ethanediamide N-[(1-ethylpyrrolidin-2-yl)methyl]-N'-(4-pentoxyphenyl)ethanediamide SMR000294025 | cid_2954663
Type:
Small organic molecule
Emp. Form.:
C20H31N3O3
Mol. Mass.:
361.4784
SMILES:
CCCCCOc1ccc(NC(=O)C(=O)NCC2CCCN2CC)cc1
: