Target
Xylosyl- and glucuronyltransferase LARGE1
Ligand
BDBM94730
Substrate
EC50
8890±n/a nM
Citation
 PubChem, PC Dose response confirmation of small molecule activators of alpha dystroglycan glycosylation PubChem Bioassay (2012)[AID] 
Target
Name:
Xylosyl- and glucuronyltransferase LARGE1
Synonyms:
KIAA0609 LARGE | LARGE1
Type:
Enzyme Catalytic Domain
Mol. Mass.:
88079.63
Organism:
Homo sapiens (Human)
Description:
gi_47678551
Residue:
756
  
Inhibitor
Name:
BDBM94730
Synonyms:
MLS000703499 N-(2-fluorophenyl)-5-nitro-thiophene-2-carboxamide SMR000322899 | cid_4191742
Type:
Small organic molecule
Emp. Form.:
C11H7FN2O3S
Mol. Mass.:
266.248
SMILES:
[O-][N+](=O)c1ccc(s1)C(=O)Nc1ccccc1F
: