Target
Xylosyl- and glucuronyltransferase LARGE1
Ligand
BDBM64181
Substrate
EC50
4750±n/a nM
Citation
 PubChem, PC Dose response confirmation of small molecule activators of alpha dystroglycan glycosylation PubChem Bioassay (2012)[AID] 
Target
Name:
Xylosyl- and glucuronyltransferase LARGE1
Synonyms:
KIAA0609 LARGE | LARGE1
Type:
Enzyme Catalytic Domain
Mol. Mass.:
88079.63
Organism:
Homo sapiens (Human)
Description:
gi_47678551
Residue:
756
  
Inhibitor
Name:
BDBM64181
Synonyms:
4-(7-ethyl-1H-indol-3-yl)-N-(2-methoxyethyl)-1,3-thiazol-2-amine MLS001174721 [4-(7-ethyl-1H-indol-3-yl)thiazol-2-yl]-(2-methoxyethyl)amine | cid_4826888
Type:
Small organic molecule
Emp. Form.:
C16H19N3OS
Mol. Mass.:
301.407
SMILES:
CCc1cccc2c(c[nH]c12)-c1csc(NCCOC)n1
: