Target
Xylosyl- and glucuronyltransferase LARGE1
Ligand
BDBM94746
Substrate
EC50
2480±n/a nM
Citation
 PubChem, PC Dose response confirmation of small molecule activators of alpha dystroglycan glycosylation PubChem Bioassay (2012)[AID] 
Target
Name:
Xylosyl- and glucuronyltransferase LARGE1
Synonyms:
KIAA0609 LARGE | LARGE1
Type:
Enzyme Catalytic Domain
Mol. Mass.:
88079.63
Organism:
Homo sapiens (Human)
Description:
gi_47678551
Residue:
756
  
Inhibitor
Name:
BDBM94746
Synonyms:
4-tert-butyl-N-[4-(3-pyridylmethylcarbamoyl)phenyl]benzamide 4-tert-butyl-N-[4-[oxo-(3-pyridinylmethylamino)methyl]phenyl]benzamide SMR000599775 | cid_1150803
Type:
Small organic molecule
Emp. Form.:
C24H25N3O2
Mol. Mass.:
387.4742
SMILES:
CC(C)(C)c1ccc(cc1)C(=O)Nc1ccc(cc1)C(=O)NCc1cccnc1
: