Target
Sentrin-specific protease 1
Ligand
BDBM65954
Substrate
IC50
4610±n/a nM
Citation
 PubChem, PC Dose response confirmation of small molecule inhibitors of the catalytic domain of the SUMO protease, SENP1 in a FRET assay PubChem Bioassay (2012)[AID] 
Target
Name:
Sentrin-specific protease 1
Synonyms:
SENP1 Sentrin-specific protease 1 (SENP1)
Type:
Protein
Mol. Mass.:
73500.42
Organism:
Homo sapiens (Human)
Description:
Q9P0U3
Residue:
644
  
Inhibitor
Name:
BDBM65954
Synonyms:
4-hydroxy-N-[(E)-1-(10H-phenothiazin-2-yl)ethylideneamino]benzamide 4-oxidanyl-N-[1-(10H-phenothiazin-2-yl)ethylideneamino]benzamide SR-01000697372-3 | cid_3307928
Type:
Small organic molecule
Emp. Form.:
C21H17N3O2S
Mol. Mass.:
375.444
SMILES:
CC(=NNC(=O)c1ccc(O)cc1)c1ccc2Sc3ccccc3Nc2c1
: