Target
Sentrin-specific protease 1
Ligand
BDBM94824
Substrate
IC50
6140±n/a nM
Citation
 PubChem, PC Dose response confirmation of small molecule inhibitors of the catalytic domain of the SUMO protease, SENP1 in a FRET assay PubChem Bioassay (2012)[AID] 
Target
Name:
Sentrin-specific protease 1
Synonyms:
SENP1 Sentrin-specific protease 1 (SENP1)
Type:
Protein
Mol. Mass.:
73500.42
Organism:
Homo sapiens (Human)
Description:
Q9P0U3
Residue:
644
  
Inhibitor
Name:
BDBM94824
Synonyms:
(2E)-2-[(2E)-2-(3-bromanyl-6-oxidanylidene-cyclohexa-2,4-dien-1-ylidene)ethylidene]-3-(2-hydroxyethyl)-1H-quinazolin-4-one (2E)-2-[(2E)-2-(3-bromo-6-oxo-1-cyclohexa-2,4-dienylidene)ethylidene]-3-(2-hydroxyethyl)-1H-quinazolin-4-one 2-[2-(5-bromo-2-hydroxyphenyl)vinyl]-3-(2-hydroxyethyl)-4(3H)-quinazolinone SMR000476476 | cid_6516168
Type:
Small organic molecule
Emp. Form.:
C18H15BrN2O3
Mol. Mass.:
387.227
SMILES:
OCCn1c(C=Cc2cc(Br)ccc2O)nc2ccccc2c1=O
: