Target
Sentrin-specific protease 1
Ligand
BDBM67442
Substrate
IC50
8550±n/a nM
Citation
 PubChem, PC Dose response confirmation of small molecule inhibitors of the catalytic domain of the SUMO protease, SENP1 in a FRET assay PubChem Bioassay (2012)[AID] 
Target
Name:
Sentrin-specific protease 1
Synonyms:
SENP1 Sentrin-specific protease 1 (SENP1)
Type:
Protein
Mol. Mass.:
73500.42
Organism:
Homo sapiens (Human)
Description:
Q9P0U3
Residue:
644
  
Inhibitor
Name:
BDBM67442
Synonyms:
3-hydroxy-1-phenalenone 3-hydroxyphenalen-1-one MLS001008607 cid_139030
Type:
Small organic molecule
Emp. Form.:
C13H8O2
Mol. Mass.:
196.2014
SMILES:
O=C1CC(=O)c2cccc3cccc1c23
: