Target
Sentrin-specific protease 1
Ligand
BDBM50189778
Substrate
IC50
15200±n/a nM
Citation
 PubChem, PC Dose response confirmation of small molecule inhibitors of the catalytic domain of the SUMO protease, SENP1 in a FRET assay PubChem Bioassay (2012)[AID] 
Target
Name:
Sentrin-specific protease 1
Synonyms:
SENP1 Sentrin-specific protease 1 (SENP1)
Type:
Protein
Mol. Mass.:
73500.42
Organism:
Homo sapiens (Human)
Description:
Q9P0U3
Residue:
644
  
Inhibitor
Name:
BDBM50189778
Synonyms:
CHEMBL211405 ORG-41841 | cid_9887381
Type:
Small organic molecule
Emp. Form.:
C19H22N4O2S2
Mol. Mass.:
402.534
SMILES:
COc1cccc(c1)-c1nc(SC)nc2sc(C(=O)NC(C)(C)C)c(N)c12
: