Target
Sentrin-specific protease 1
Ligand
BDBM94864
Substrate
IC50
46300±n/a nM
Citation
 PubChem, PC Dose response confirmation of small molecule inhibitors of the catalytic domain of the SUMO protease, SENP1 in a FRET assay PubChem Bioassay (2012)[AID] 
Target
Name:
Sentrin-specific protease 1
Synonyms:
SENP1 Sentrin-specific protease 1 (SENP1)
Type:
Protein
Mol. Mass.:
73500.42
Organism:
Homo sapiens (Human)
Description:
Q9P0U3
Residue:
644
  
Inhibitor
Name:
BDBM94864
Synonyms:
1-[2-(diethylamino)ethylamino]-9-thioxanthenone MLS003106596 cid_72735
Type:
Small organic molecule
Emp. Form.:
C19H22N2OS
Mol. Mass.:
326.456
SMILES:
CCN(CC)CCNc1cccc2sc3ccccc3c(=O)c12
: