Target
Sentrin-specific protease 1
Ligand
BDBM87830
Substrate
IC50
15400±n/a nM
Citation
 PubChem, PC Dose response confirmation of small molecule inhibitors of the catalytic domain of the SUMO protease, SENP1 in a FRET assay PubChem Bioassay (2012)[AID] 
Target
Name:
Sentrin-specific protease 1
Synonyms:
SENP1 Sentrin-specific protease 1 (SENP1)
Type:
Protein
Mol. Mass.:
73500.42
Organism:
Homo sapiens (Human)
Description:
Q9P0U3
Residue:
644
  
Inhibitor
Name:
BDBM87830
Synonyms:
4-[3-(4-Fluoro-benzoyl)-thioureido]-N-(3-methoxy-pyrazin-2-yl)-benzenesulfonamide 4-fluoro-N-[[4-[(3-methoxy-2-pyrazinyl)sulfamoyl]anilino]-sulfanylidenemethyl]benzamide 4-fluoro-N-[[4-[(3-methoxypyrazin-2-yl)sulfamoyl]phenyl]thiocarbamoyl]benzamide SMR000171448 | cid_1950007
Type:
Small organic molecule
Emp. Form.:
C19H16FN5O4S2
Mol. Mass.:
461.49
SMILES:
COc1nccnc1NS(=O)(=O)c1ccc(NC(=S)NC(=O)c2ccc(F)cc2)cc1
: