Target
Sentrin-specific protease 1
Ligand
BDBM94779
Substrate
IC50
6050±n/a nM
Citation
 PubChem, PC Dose response confirmation of small molecule inhibitors of the catalytic domain of the SUMO protease, SENP1 in a kinetic FRET assay PubChem Bioassay (2012)[AID] 
Target
Name:
Sentrin-specific protease 1
Synonyms:
SENP1 Sentrin-specific protease 1 (SENP1)
Type:
Protein
Mol. Mass.:
73500.42
Organism:
Homo sapiens (Human)
Description:
Q9P0U3
Residue:
644
  
Inhibitor
Name:
BDBM94779
Synonyms:
2-(2-allyloxyethyl)-4,7-diphenyl-3a,4,7,7a-tetrahydroisoindole-1,3-quinone 4,7-diphenyl-2-(2-prop-2-enoxyethyl)-3a,4,7,7a-tetrahydroisoindole-1,3-dione SMR000142315 | cid_2944998
Type:
Small organic molecule
Emp. Form.:
C25H25NO3
Mol. Mass.:
387.4709
SMILES:
C=CCOCCN1C(=O)C2C(C(C=CC2c2ccccc2)c2ccccc2)C1=O
: