Target
Sentrin-specific protease 1
Ligand
BDBM94821
Substrate
IC50
15100±n/a nM
Citation
 PubChem, PC Dose response confirmation of small molecule inhibitors of the catalytic domain of the SUMO protease, SENP1 in a kinetic FRET assay PubChem Bioassay (2012)[AID] 
Target
Name:
Sentrin-specific protease 1
Synonyms:
SENP1 Sentrin-specific protease 1 (SENP1)
Type:
Protein
Mol. Mass.:
73500.42
Organism:
Homo sapiens (Human)
Description:
Q9P0U3
Residue:
644
  
Inhibitor
Name:
BDBM94821
Synonyms:
4-[(2E)-2-(5-quinoxalinylmethylidene)hydrazinyl]benzoic acid 4-[(N'E)-N'-(quinoxalin-5-ylmethylene)hydrazino]benzoic acid MLS000779185 cid_9682252
Type:
Small organic molecule
Emp. Form.:
C16H12N4O2
Mol. Mass.:
292.2921
SMILES:
OC(=O)c1ccc(cc1)N=NCc1cccc2nccnc12
: