Target
Sentrin-specific protease 1
Ligand
BDBM94840
Substrate
IC50
18500±n/a nM
Citation
 PubChem, PC Dose response confirmation of small molecule inhibitors of the catalytic domain of the SUMO protease, SENP1 in a kinetic FRET assay PubChem Bioassay (2012)[AID] 
Target
Name:
Sentrin-specific protease 1
Synonyms:
SENP1 Sentrin-specific protease 1 (SENP1)
Type:
Protein
Mol. Mass.:
73500.42
Organism:
Homo sapiens (Human)
Description:
Q9P0U3
Residue:
644
  
Inhibitor
Name:
BDBM94840
Synonyms:
2,4-bis(fluoranyl)-N-(2-methyl-1,3-benzothiazol-6-yl)benzenesulfonamide MLS002164706 cid_8603505
Type:
Small organic molecule
Emp. Form.:
C14H10F2N2O2S2
Mol. Mass.:
340.368
SMILES:
Cc1nc2ccc(NS(=O)(=O)c3ccc(F)cc3F)cc2s1
: