Target
Sentrin-specific protease 1
Ligand
BDBM94862
Substrate
IC50
22300±n/a nM
Citation
 PubChem, PC Dose response confirmation of small molecule inhibitors of the catalytic domain of the SUMO protease, SENP1 in a kinetic FRET assay PubChem Bioassay (2012)[AID] 
Target
Name:
Sentrin-specific protease 1
Synonyms:
SENP1 Sentrin-specific protease 1 (SENP1)
Type:
Protein
Mol. Mass.:
73500.42
Organism:
Homo sapiens (Human)
Description:
Q9P0U3
Residue:
644
  
Inhibitor
Name:
BDBM94862
Synonyms:
1-[2-(diethylamino)ethylamino]-4-(hydroxymethyl)-9-xanthenone 1-[2-(diethylamino)ethylamino]-4-methylol-xanthone SMR001821486 | cid_296314
Type:
Small organic molecule
Emp. Form.:
C20H24N2O3
Mol. Mass.:
340.4162
SMILES:
CCN(CC)CCNc1ccc(CO)c2oc3ccccc3c(=O)c12
: