Target
Sentrin-specific protease 1
Ligand
BDBM94871
Substrate
IC50
15800±n/a nM
Citation
 PubChem, PC Dose response confirmation of small molecule inhibitors of the catalytic domain of the SUMO protease, SENP1 in a kinetic FRET assay PubChem Bioassay (2012)[AID] 
Target
Name:
Sentrin-specific protease 1
Synonyms:
SENP1 Sentrin-specific protease 1 (SENP1)
Type:
Protein
Mol. Mass.:
73500.42
Organism:
Homo sapiens (Human)
Description:
Q9P0U3
Residue:
644
  
Inhibitor
Name:
BDBM94871
Synonyms:
(2Z)-2-(1-benzyl-2H-tetrazol-5-ylidene)benzo[g]quinoxalin-3-one (2Z)-2-[1-(phenylmethyl)-2H-tetrazol-5-ylidene]-3-benzo[g]quinoxalinone SMR002134469 | cid_53299663
Type:
Small organic molecule
Emp. Form.:
C20H14N6O
Mol. Mass.:
354.3648
SMILES:
O=c1[nH]c2cc3ccccc3cc2nc1-c1nnnn1Cc1ccccc1
: